term
type: Class
name: term
subclass of: Class
comment: term: the class of all GO terms, a subclass of owl:Class

Thing
type: Class
name: Thing
type: term

Object
type: Class
subclass of: Thing
name: Object
disjoint with: Event
definition: the class of Objects; disjoint with Event
creator: SA
date: 08/11/04
type: term

Event
type: Class
subclass of: Thing
name: Event
definition: the class of Events
creator: SA
date: 08/11/04
type: term

AttributeValue
type: Class
subclass of: Thing
name: AttributeValue
definition: a class containing all attribute values
creator: SA
date: 08/11/04
type: term

PhysicalAnatomicalEntity
type: Class
subclass of: Object
name: PhysicalAnatomicalEntity
disjoint with: Organism
definition: the class of all anatomical entities (parts); disjoint with Organism
creator: SA
date: 08/11/04
type: term

Organism
type: Class
subclass of: Object
name: Organism
definition: the class of all whole organisms
creator: SA
date: 08/11/04
type: term

ObjectClass
type: Class
name: ObjectClass
subclass of: term
disjoint with: EventClass
comment: ObjectClass: a class of classes which are subclasses of XUO.0000001 Object

EventClass
type: Class
name: EventClass
subclass of: term
disjoint with: ObjectClass
comment: EventClass: a class of classes which are subclasses of XUO.0000002 Event

PhysicalAnatomicalEntityClass
type: Class
name: PhysicalAnatomicalEntityClass
subclass of: ObjectClass
disjoint with: OrganismClass
comment: PhysicalAnatomicalEntityClass: a class of classes which are subclasses of XUO.0000004 PhysicalAnatomicalEntity

OrganismClass
type: Class
name: OrganismClass
subclass of: ObjectClass
disjoint with: PhysicalAnatomicalEntityClass
comment: OrganismClass: a class of classes which are subclasses of XUO.0000005 Organism

PartOfProperty
type: Class
name: PartOfProperty
subclass of: ObjectProperty
comment: PartOfProperty: a class of properties which are part-of relations, or restrictions applying to part-of

parts
type: PartOfProperty
comment: (parts Part Whole) no interpretation is specified at this level

isPartOf
type: PartOfProperty
domain: Object
range: Object
sub property of: parts
comment: isPartOf: the conventional instance-level part-of relation

isProperPartOf
type: PartOfProperty
domain: Object
range: Object
sub property of: isPartOf
comment: isProperPartOf: the conventional instance-level part-of relation

isSubEventOf
type: PartOfProperty
domain: Event
range: Event
sub property of: parts
comment: isSubEventOf: the conventional instance-level sub-event (part-of event) relation (isSubEventOf Part Whole) where Part and Whole are Events and not Classes. The axiomatisation of subEvent relations follows that of parts - see the corresponding part relation for details.

isProperSubEventOf
type: PartOfProperty
domain: Event
range: Event
sub property of: isSubEventOf
comment: isSubEventOf: the conventional instance-level sub-event (part-of event) relation

partOf
type: PartOfProperty
domain: ObjectClass
range: ObjectClass
sub property of: parts
comment: partOf: the restriction of parts to Object classes.

subEventOf
type: PartOfProperty
domain: EventClass
range: EventClass
sub property of: parts
comment: subEventOf: the restriction of parts to Event classes. This relation can be qualified in the same way as partOf (see the comment for partOf).

startStage
type: PartOfProperty
domain: PhysicalAnatomicalEntityClass
range: StageAttributeValue
comment: object class to start stage attribute value

endStage
type: PartOfProperty
domain: PhysicalAnatomicalEntityClass
range: StageAttributeValue
comment: object class to end stage attribute value

hasStage
type: PartOfProperty
domain: PhysicalAnatomicalEntityClass
range: StageAttributeValue
comment: object class to stage attribute value i.e. all stages after or equal to the startStage and before or equal to the endStage

classDefinition
type: PartOfProperty
domain: term
range: term
comment: This relation is used in conjunction with partOf or subEventOf to state that the part-whole relation holds of the whole-class and all subclasses of it.

termDefinition
type: PartOfProperty
domain: term
range: term
comment: This relation is used in conjunction with partOf or subEventOf to state that the part-whole relation holds of the whole-class but not of subclasses of it.

directPartDefinition
type: PartOfProperty
domain: term
range: term
comment: This relation is used conjunction with partOf or subEventOf to state that there are no parts between the part and the whole.

partDefinition
type: PartOfProperty
domain: term
range: term
comment: This relation is used conjunction with partOf or subEventOf to state that the part is defined by being part of the whole.

StageAttributeValue
type: Class
subclass of: AttributeValue
name: StageAttributeValue
definition: the class of all stage attributes
creator: SA
date: 08/11/04
type: term

SexAttributeValue
type: Class
subclass of: AttributeValue
name: SexAttributeValue
definition: the class of all sex attribute values
creator: SA
date: 08/11/04
type: term

Mammalia
type: Class
subclass of: Organism
name: Mammalia
definition: the class of all mammals
creator: SA
date: 08/11/04
type: term

Mus musculus
type: Class
subclass of: Mammalia
name: Mus musculus
definition: the class of all mouse organisms
creator: SA
date: 08/11/04
type: term

Male Mus musculus
type: Class
subclass of: Mus musculus
disjoint with: Female Mus musculus
name: Male Mus musculus
definition: the class of all male mouse organisms
creator: SA
date: 08/11/04
type: term

Female Mus musculus
type: Class
subclass of: Mus musculus
name: Female Mus musculus
definition: the class of all female mouse organisms
creator: SA
date: 08/11/04
type: term

Drosophila melanogaster
type: Class
subclass of: Organism
name: Drosophila melanogaster
definition: the class of all drosophila organisms
creator: SA
date: 08/11/04
type: term

Male Drosophila melanogaster
type: Class
subclass of: Drosophila melanogaster
disjoint with: Female Drosophila melanogaster
name: Male Drosophila melanogaster
definition: the class of all male drosophila organisms
creator: SA
date: 08/11/04
type: term

Female Drosophila melanogaster
type: Class
subclass of: Drosophila melanogaster
name: Female Drosophila melanogaster
definition: the class of all female drosophila organisms
creator: SA
date: 08/11/04
type: term

Caenorhabditis elegans
type: Class
subclass of: Organism
name: Caenorhabditis elegans
definition: the class of all C. Elegans organisms
creator: SA
date: 08/11/04
type: term

Male Caenorhabditis elegans
type: Class
subclass of: Caenorhabditis elegans
disjoint with: Hermaphrodite Caenorhabditis elegans
name: Male Caenorhabditis elegans
definition: the class of all male C. Elegans organisms
creator: SA
date: 08/11/04
type: term

Hermaphrodite Caenorhabditis elegans
type: Class
subclass of: Caenorhabditis elegans
name: Hermaphrodite Caenorhabditis elegans
definition: the class of all hermaphrodite C. Elegans organisms
creator: SA
date: 08/11/04
type: term

Homo sapiens
type: Class
subclass of: Mammalia
name: Homo sapiens
definition: the class of all humans
creator: SA
date: 08/11/04
type: term

Male Homo sapiens
type: Class
subclass of: Homo sapiens
disjoint with: Female Homo sapiens
name: Male Homo sapiens
definition: the class of all male humans
creator: SA
date: 08/11/04
type: term

Female Homo sapiens
type: Class
subclass of: Homo sapiens
name: Female Homo sapiens
definition: the class of all female humans
creator: SA
date: 08/11/04
type: term

TheilerStage
type: Class
subclass of: StageAttributeValue
name: TheilerStage
definition: the set of Theiler stages
creator: SA
date: 08/11/04
type: term

CarnegieStage
type: Class
subclass of: StageAttributeValue
name: CarnegieStage
definition: the set of Carnegie stages
creator: SA
date: 08/11/04
type: term

accession
type: DatatypeProperty
domain: term
range: Literal
comment: accession is (#PCDATA) in the dtd

name
type: DatatypeProperty
domain: term
range: Literal
comment: name is (#PCDATA) in the dtd

synonym
type: DatatypeProperty
domain: term
range: Literal
comment: synonym is (#PCDATA) in the dtd

definition
type: DatatypeProperty
domain: term
range: Literal
comment: definition is (#PCDATA) in the dtd

n_associations
type: DatatypeProperty
domain: term
range: Literal
comment: n_associations is (wrongly) in !ATTLIST of term in the dtd

association
type: ObjectProperty
domain: term
comment: association has two components go:evidence go:gene_product

dbxref
type: ObjectProperty
domain: term
comment: dbxref has two components go:database_symbol, go:reference

evidence
type: DatatypeProperty
range: Literal
comment: evidence is linked via a blank node from association

gene_product
type: DatatypeProperty
range: Literal
comment: gene_product is linked via a blank node from association

database_symbol
type: DatatypeProperty
range: Literal
comment: database_symbol is linked via a blank node from dbxref

reference
type: DatatypeProperty
range: Literal
comment: reference is linked via a blank node from dbxref

Female
type: XUO.0000016

Male
type: XUO.0000016

Hermaphrodite
type: XUO.0000016

CarnegieStage05a
type: XUO.0000017
name: CarnegieStage05a
creator: SA
date: 20/03/04

CarnegieStage05b
type: XUO.0000017
name: CarnegieStage05b
creator: SA
date: 20/03/04

CarnegieStage05c
type: XUO.0000017
name: CarnegieStage05c
creator: SA
date: 20/03/04

CarnegieStage06a
type: XUO.0000017
name: CarnegieStage06a
creator: SA
date: 20/03/04

CarnegieStage06b
type: XUO.0000017
name: CarnegieStage06b
creator: SA
date: 20/03/04

CarnegieStage15
type: XUO.0000017

TheilerStage14
type: XUO.0000018
creator: SA
date: 20/03/04

CarnegieStage01
type: XUO.0000017

TheilerStage23
type: XUO.0000018
creator: SA
date: 20/03/04

CarnegieStage12
type: XUO.0000017

TheilerStage01
type: XUO.0000018
creator: SA
date: 20/03/04

CarnegieStage02
type: XUO.0000017

TheilerStage15
type: XUO.0000018
creator: SA
date: 20/03/04

TheilerStage04
type: XUO.0000018
creator: SA
date: 20/03/04

TheilerStage05
type: XUO.0000018
creator: SA
date: 20/03/04

CarnegieStage07
type: XUO.0000017

TheilerStage20
type: XUO.0000018
creator: SA
date: 20/03/04

TheilerStage11
type: XUO.0000018
creator: SA
date: 20/03/04

TheilerStage19
type: XUO.0000018
creator: SA
date: 20/03/04

CarnegieStage19
type: XUO.0000017

TheilerStage22
type: XUO.0000018
creator: SA
date: 20/03/04

TheilerStage12
type: XUO.0000018
creator: SA
date: 20/03/04

CarnegieStage04
type: XUO.0000017

TheilerStage26
type: XUO.0000018
creator: SA
date: 20/03/04

TheilerStage24
type: XUO.0000018
creator: SA
date: 20/03/04

TheilerStage17
type: XUO.0000018
creator: SA
date: 20/03/04

TheilerStage02
type: XUO.0000018
creator: SA
date: 20/03/04

TheilerStage09
type: XUO.0000018
creator: SA
date: 20/03/04

CarnegieStage09
type: XUO.0000017

TheilerStage08
type: XUO.0000018
creator: SA
date: 20/03/04

CarnegieStage08
type: XUO.0000017

TheilerStage07
type: XUO.0000018
creator: SA
date: 20/03/04

CarnegieStage23
type: XUO.0000017

TheilerStage21
type: XUO.0000018
creator: SA
date: 20/03/04

CarnegieStage17
type: XUO.0000017

TheilerStage27
type: XUO.0000018
creator: SA
date: 20/03/04

TheilerStage16
type: XUO.0000018
creator: SA
date: 20/03/04

TheilerStage18
type: XUO.0000018
creator: SA
date: 20/03/04

CarnegieStage20
type: XUO.0000017

CarnegieStage21
type: XUO.0000017

CarnegieStage14
type: XUO.0000017

TheilerStage13
type: XUO.0000018
creator: SA
date: 20/03/04

CarnegieStage10
type: XUO.0000017

TheilerStage03
type: XUO.0000018
creator: SA
date: 20/03/04

CarnegieStage13
type: XUO.0000017

CarnegieStage06
type: XUO.0000017

CarnegieStage16
type: XUO.0000017

CarnegieStage05
type: XUO.0000017

TheilerStage25
type: XUO.0000018
creator: SA
date: 20/03/04

TheilerStage10
type: XUO.0000018
creator: SA
date: 20/03/04

TheilerStage28
type: XUO.0000018
creator: SA
date: 20/03/04

CarnegieStage22
type: XUO.0000017

CarnegieStage18
type: XUO.0000017

CarnegieStage11
type: XUO.0000017

TheilerStage06
type: XUO.0000018
creator: SA
date: 20/03/04

CarnegieStage03
type: XUO.0000017