Female Drosophila melanogaster
type: Class
subclass of: Drosophila melanogaster
definition: the class of all female drosophila organisms
name: Female Drosophila melanogaster

Drosophila melanogaster
type: Class
subclass of: Organism
name: Drosophila melanogaster
definition: the class of all drosophila organisms

PhysicalAnatomicalEntity
type: Class
definition: the class of all anatomical entities (parts); disjoint with Organism
subclass of: Object
name: PhysicalAnatomicalEntity
disjoint with: Organism

Object
type: Class
definition: the class of Objects; disjoint with Event
name: Object
disjoint with: Event
subclass of: Thing

Organism
type: Class
name: Organism
subclass of: Object
definition: the class of all whole organisms

PartOfProperty
type: Class
comment: PartOfProperty: a class of properties which are part-of relations, or restrictions applying to part-of
subclass of: ObjectProperty

Male Homo sapiens
type: Class
disjoint with: Female Homo sapiens
subclass of: Homo sapiens
definition: the class of all male humans
name: Male Homo sapiens

Female Homo sapiens
type: Class
definition: the class of all female humans
subclass of: Homo sapiens
name: Female Homo sapiens

Homo sapiens
type: Class
definition: the class of all humans
subclass of: Mammalia
name: Homo sapiens

AttributeValue
type: Class
subclass of: Thing
name: AttributeValue
definition: a class containing all attribute values

Thing
type: Class
name: Thing

Mammalia
type: Class
definition: the class of all mammals
subclass of: Organism
name: Mammalia

term
type: Class
comment: term: the class of all GO terms, a subclass of owl:Class
subclass of: Class

Male Mus musculus
type: Class
name: Male Mus musculus
disjoint with: Female Mus musculus
subclass of: Mus musculus
definition: the class of all male mouse organisms

Female Mus musculus
type: Class
definition: the class of all female mouse organisms
name: Female Mus musculus
subclass of: Mus musculus

Mus musculus
type: Class
definition: the class of all mouse organisms
subclass of: Mammalia
name: Mus musculus

Male Caenorhabditis elegans
type: Class
disjoint with: Hermaphrodite Caenorhabditis elegans
subclass of: Caenorhabditis elegans
definition: the class of all male C. Elegans organisms
name: Male Caenorhabditis elegans

Hermaphrodite Caenorhabditis elegans
type: Class
name: Hermaphrodite Caenorhabditis elegans
subclass of: Caenorhabditis elegans
definition: the class of all hermaphrodite C. Elegans organisms

Caenorhabditis elegans
type: Class
name: Caenorhabditis elegans
definition: the class of all C. Elegans organisms
subclass of: Organism

TheilerStage
type: Class
definition: the set of Theiler stages
subclass of: StageAttributeValue
name: TheilerStage

StageAttributeValue
type: Class
name: StageAttributeValue
subclass of: AttributeValue
definition: the class of all stage attributes

OrganismClass
type: Class
subclass of: ObjectClass
disjoint with: PhysicalAnatomicalEntityClass
comment: OrganismClass: a class of classes which are subclasses of XUO.0000005 Organism

ObjectClass
type: Class
subclass of: term
disjoint with: EventClass
comment: ObjectClass: a class of classes which are subclasses of XUO.0000001 Object

PhysicalAnatomicalEntityClass
type: Class
disjoint with: OrganismClass
comment: PhysicalAnatomicalEntityClass: a class of classes which are subclasses of XUO.0000004 PhysicalAnatomicalEntity
subclass of: ObjectClass

Event
type: Class
name: Event
definition: the class of Events
subclass of: Thing

Male Drosophila melanogaster
type: Class
name: Male Drosophila melanogaster
disjoint with: Female Drosophila melanogaster
subclass of: Drosophila melanogaster
definition: the class of all male drosophila organisms

EventClass
type: Class
comment: EventClass: a class of classes which are subclasses of XUO.0000002 Event
subclass of: term
disjoint with: ObjectClass

SexAttributeValue
type: Class
subclass of: AttributeValue
definition: the class of all sex attribute values
name: SexAttributeValue

CarnegieStage
type: Class
name: CarnegieStage
subclass of: StageAttributeValue
definition: the set of Carnegie stages

dbxref
type: ObjectProperty
comment: dbxref has two components go:database_symbol, go:reference
domain: term

association
type: ObjectProperty
comment: association has two components go:evidence go:gene_product
domain: term

accession
type: DatatypeProperty
domain: term
comment: accession is (#PCDATA) in the dtd

definition
type: DatatypeProperty
domain: term
comment: definition is (#PCDATA) in the dtd

synonym
type: DatatypeProperty
domain: term
comment: synonym is (#PCDATA) in the dtd

gene_product
type: DatatypeProperty
comment: gene_product is linked via a blank node from association

name
type: DatatypeProperty
comment: name is (#PCDATA) in the dtd
domain: term

database_symbol
type: DatatypeProperty
comment: database_symbol is linked via a blank node from dbxref

n_associations
type: DatatypeProperty
domain: term
comment: n_associations is (wrongly) in !ATTLIST of term in the dtd

reference
type: DatatypeProperty
comment: reference is linked via a blank node from dbxref

evidence
type: DatatypeProperty
comment: evidence is linked via a blank node from association

hasStage
type: PartOfProperty
range: StageAttributeValue
domain: PhysicalAnatomicalEntityClass
comment: object class to stage attribute value i.e. all stages after or equal to the startStage and before or equal to the endStage

TheilerStage04
type: XUO.0000018

CarnegieStage06a
type: XUO.0000017

CarnegieStage19
type: XUO.0000017

isProperPartOf
type: PartOfProperty
range: Object
comment: isProperPartOf: the conventional instance-level part-of relation
sub property of: isPartOf
domain: Object

isPartOf
type: PartOfProperty
range: Object
domain: Object
comment: isPartOf: the conventional instance-level part-of relation
sub property of: parts

parts
type: PartOfProperty
comment: (parts Part Whole) no interpretation is specified at this level

CarnegieStage05
type: XUO.0000017

CarnegieStage06b
type: XUO.0000017

TheilerStage12
type: XUO.0000018

CarnegieStage09
type: XUO.0000017

endStage
type: PartOfProperty
domain: PhysicalAnatomicalEntityClass
comment: object class to end stage attribute value
range: StageAttributeValue

TheilerStage03
type: XUO.0000018

CarnegieStage16
type: XUO.0000017

isProperSubEventOf
type: PartOfProperty
comment: isSubEventOf: the conventional instance-level sub-event (part-of event) relation
domain: Event
range: Event
sub property of: isSubEventOf

isSubEventOf
type: PartOfProperty
domain: Event
sub property of: parts
range: Event
comment: isSubEventOf: the conventional instance-level sub-event (part-of event) relation (isSubEventOf Part Whole) where Part and Whole are Events and not Classes. The axiomatisation of subEvent relations follows that of parts - see the corresponding part relation for details.

CarnegieStage14
type: XUO.0000017

TheilerStage26
type: XUO.0000018

TheilerStage24
type: XUO.0000018

termDefinition
type: PartOfProperty
range: term
comment: This relation is used in conjunction with partOf or subEventOf to state that the part-whole relation holds of the whole-class but not of subclasses of it.
domain: term

CarnegieStage06
type: XUO.0000017

TheilerStage28
type: XUO.0000018

partOf
type: PartOfProperty
sub property of: parts
range: ObjectClass
domain: ObjectClass
comment: partOf: the restriction of parts to Object classes.

TheilerStage07
type: XUO.0000018

CarnegieStage07
type: XUO.0000017

CarnegieStage22
type: XUO.0000017

TheilerStage08
type: XUO.0000018

CarnegieStage21
type: XUO.0000017

Hermaphrodite
type: XUO.0000016

TheilerStage06
type: XUO.0000018

Male
type: XUO.0000016

partDefinition
type: PartOfProperty
comment: This relation is used conjunction with partOf or subEventOf to state that the part is defined by being part of the whole.
domain: term
range: term

directPartDefinition
type: PartOfProperty
domain: term
range: term
comment: This relation is used conjunction with partOf or subEventOf to state that there are no parts between the part and the whole.

TheilerStage25
type: XUO.0000018

CarnegieStage20
type: XUO.0000017

subEventOf
type: PartOfProperty
domain: EventClass
comment: subEventOf: the restriction of parts to Event classes. This relation can be qualified in the same way as partOf (see the comment for partOf).
sub property of: parts
range: EventClass

classDefinition
type: PartOfProperty
comment: This relation is used in conjunction with partOf or subEventOf to state that the part-whole relation holds of the whole-class and all subclasses of it.
domain: term
range: term

TheilerStage21
type: XUO.0000018

CarnegieStage05c
type: XUO.0000017

TheilerStage27
type: XUO.0000018

TheilerStage16
type: XUO.0000018

Female
type: XUO.0000016

TheilerStage09
type: XUO.0000018

TheilerStage23
type: XUO.0000018

CarnegieStage04
type: XUO.0000017

CarnegieStage15
type: XUO.0000017

TheilerStage18
type: XUO.0000018

CarnegieStage23
type: XUO.0000017

TheilerStage17
type: XUO.0000018

startStage
type: PartOfProperty
range: StageAttributeValue
comment: object class to start stage attribute value
domain: PhysicalAnatomicalEntityClass

CarnegieStage11
type: XUO.0000017

CarnegieStage05b
type: XUO.0000017

TheilerStage01
type: XUO.0000018

CarnegieStage05a
type: XUO.0000017

CarnegieStage08
type: XUO.0000017

CarnegieStage10
type: XUO.0000017

TheilerStage11
type: XUO.0000018

CarnegieStage12
type: XUO.0000017

TheilerStage10
type: XUO.0000018

CarnegieStage13
type: XUO.0000017

TheilerStage22
type: XUO.0000018

TheilerStage05
type: XUO.0000018

CarnegieStage18
type: XUO.0000017

TheilerStage19
type: XUO.0000018

TheilerStage15
type: XUO.0000018

TheilerStage20
type: XUO.0000018

TheilerStage14
type: XUO.0000018

CarnegieStage01
type: XUO.0000017

TheilerStage02
type: XUO.0000018

TheilerStage13
type: XUO.0000018

CarnegieStage02
type: XUO.0000017

CarnegieStage17
type: XUO.0000017

CarnegieStage03
type: XUO.0000017